• LoginCSVTest

    9:17:46 PM / 00:00:01:894 Fail

    LoginCSVTest
    10.11.2026 9:17:46 PM 10.11.2026 9:17:48 PM 00:00:01:894 · #test-id=1
    StatusTimestampDetails
    Fail 9:17:48 PM LoginCSVTest FAILED
    Fail 9:17:48 PM no such element: Unable to locate element: {"method":"xpath","selector":"//a[@title="View my customer account"]//span"} (Session info: chrome=154.0.8037.97) For documentation on this error, please visit: https://www.selenium.dev/documentation/webdriver/troubleshooting/errors#nosuchelementexception Build info: version: '4.48.0', revision: '27f5213 27f5213055e28398a5105b7892b7a3bb2012a6ef' System info: os.name: 'Linux', os.arch: 'amd64', os.version: '6.17.0-1022-azure', java.version: '11.0.32.1' Driver info: org.openqa.selenium.chrome.ChromeDriver Command: [5f55f3377e74bf78f6228f7e48e49660, findElement {using=xpath, value=//a[@title="View my customer account"]//span}] Capabilities {acceptInsecureCerts: false, browserName: chrome, browserVersion: 154.0.8037.97, chrome: {chromedriverVersion: 154.0.8037.92 (334b65d254cc..., userDataDir: /tmp/org.chromium.Chromium....}, fedcm:accounts: true, goog:chromeOptions: {debuggerAddress: localhost:37535}, goog:processID: 2379, networkConnectionEnabled: false, pageLoadStrategy: normal, platformName: linux, proxy: Proxy(), se:cdp: ws://localhost:37535/devtoo..., se:cdpVersion: 154.0.8037.97, setWindowRect: true, strictFileInteractability: false, timeouts: {implicit: 0, pageLoad: 300000, script: 30000}, unhandledPromptBehavior: dismiss and notify, webauthn:extension:cmtgKey: true, webauthn:extension:credBlob: true, webauthn:extension:largeBlob: true, webauthn:extension:minPinLength: true, webauthn:extension:prf: true, webauthn:virtualAuthenticators: true} Session ID: 5f55f3377e74bf78f6228f7e48e49660
  • LoginExcelTest

    9:17:48 PM / 00:00:01:870 Skip

    LoginExcelTest
    10.11.2026 9:17:48 PM 10.11.2026 9:17:50 PM 00:00:01:870 · #test-id=2
    StatusTimestampDetails
    Skip 9:17:50 PM LoginExcelTest SKIPPED
  • invalidCredLoginTest

    9:17:48 PM / 00:00:01:871 Pass

    invalidCredLoginTest
    10.11.2026 9:17:48 PM 10.11.2026 9:17:50 PM 00:00:01:871 · #test-id=3
    StatusTimestampDetails
    Pass 9:17:50 PM invalidCredLoginTest PASSED
  • LoginTest

    9:17:48 PM / 00:00:01:890 Fail

    LoginTest
    10.11.2026 9:17:48 PM 10.11.2026 9:17:50 PM 00:00:01:890 · #test-id=4
    StatusTimestampDetails
    Fail 9:17:50 PM LoginTest FAILED
    Fail 9:17:50 PM no such element: Unable to locate element: {"method":"xpath","selector":"//a[@title="View my customer account"]//span"} (Session info: chrome=154.0.8037.97) For documentation on this error, please visit: https://www.selenium.dev/documentation/webdriver/troubleshooting/errors#nosuchelementexception Build info: version: '4.48.0', revision: '27f5213 27f5213055e28398a5105b7892b7a3bb2012a6ef' System info: os.name: 'Linux', os.arch: 'amd64', os.version: '6.17.0-1022-azure', java.version: '11.0.32.1' Driver info: org.openqa.selenium.chrome.ChromeDriver Command: [738fc9efbea7dbfb0a79e7df9bdbdf9b, findElement {using=xpath, value=//a[@title="View my customer account"]//span}] Capabilities {acceptInsecureCerts: false, browserName: chrome, browserVersion: 154.0.8037.97, chrome: {chromedriverVersion: 154.0.8037.92 (334b65d254cc..., userDataDir: /tmp/org.chromium.Chromium....}, fedcm:accounts: true, goog:chromeOptions: {debuggerAddress: localhost:43641}, goog:processID: 2376, networkConnectionEnabled: false, pageLoadStrategy: normal, platformName: linux, proxy: Proxy(), se:cdp: ws://localhost:43641/devtoo..., se:cdpVersion: 154.0.8037.97, setWindowRect: true, strictFileInteractability: false, timeouts: {implicit: 0, pageLoad: 300000, script: 30000}, unhandledPromptBehavior: dismiss and notify, webauthn:extension:cmtgKey: true, webauthn:extension:credBlob: true, webauthn:extension:largeBlob: true, webauthn:extension:minPinLength: true, webauthn:extension:prf: true, webauthn:virtualAuthenticators: true} Session ID: 738fc9efbea7dbfb0a79e7df9bdbdf9b
  • VerifyAddNewAddressAtFirstTimeTest

    9:17:52 PM / 00:00:30:118 Fail

    VerifyAddNewAddressAtFirstTimeTest
    10.11.2026 9:17:52 PM 10.11.2026 9:18:22 PM 00:00:30:118 · #test-id=5
    StatusTimestampDetails
    Fail 9:18:22 PM VerifyAddNewAddressAtFirstTimeTest FAILED
    Fail 9:18:22 PM Expected condition failed: waiting for element found by By.xpath: //a[@title = "Add my first address"] to be clickable, but the element was not found: org.openqa.selenium.NoSuchElementException: no such element: Unable to locate element: {"method":"xpath","selector":"//a[@title = "Add my first address"]"}. (tried for 30 seconds with 500 milliseconds interval) Build info: version: '4.48.0', revision: '27f5213 27f5213055e28398a5105b7892b7a3bb2012a6ef' System info: os.name: 'Linux', os.arch: 'amd64', os.version: '6.17.0-1022-azure', java.version: '11.0.32.1' Driver info: org.openqa.selenium.chrome.ChromeDriver Capabilities {acceptInsecureCerts: false, browserName: chrome, browserVersion: 154.0.8037.97, chrome: {chromedriverVersion: 154.0.8037.92 (334b65d254cc..., userDataDir: /tmp/org.chromium.Chromium....}, fedcm:accounts: true, goog:chromeOptions: {debuggerAddress: localhost:34209}, goog:processID: 2375, networkConnectionEnabled: false, pageLoadStrategy: normal, platformName: linux, proxy: Proxy(), se:cdp: ws://localhost:34209/devtoo..., se:cdpVersion: 154.0.8037.97, setWindowRect: true, strictFileInteractability: false, timeouts: {implicit: 0, pageLoad: 300000, script: 30000}, unhandledPromptBehavior: dismiss and notify, webauthn:extension:cmtgKey: true, webauthn:extension:credBlob: true, webauthn:extension:largeBlob: true, webauthn:extension:minPinLength: true, webauthn:extension:prf: true, webauthn:virtualAuthenticators: true} Session ID: 5c8a59ea048e074701ba245104ff1e08
  • LoginCSVTest

    9:17:54 PM / 00:00:02:139 Pass

    LoginCSVTest
    10.11.2026 9:17:54 PM 10.11.2026 9:17:56 PM 00:00:02:139 · #test-id=6
    StatusTimestampDetails
    Pass 9:17:56 PM LoginCSVTest PASSED
  • LoginExcelTest

    9:17:55 PM / 00:00:01:813 Skip

    LoginExcelTest
    10.11.2026 9:17:55 PM 10.11.2026 9:17:57 PM 00:00:01:813 · #test-id=7
    StatusTimestampDetails
    Skip 9:17:57 PM LoginExcelTest SKIPPED
  • LoginTest

    9:17:56 PM / 00:00:02:287 Pass

    LoginTest
    10.11.2026 9:17:56 PM 10.11.2026 9:17:58 PM 00:00:02:287 · #test-id=8
    StatusTimestampDetails
    Pass 9:17:58 PM LoginTest PASSED
  • checkoutTest

    9:17:58 PM / 00:00:01:000 Fail

    checkoutTest
    10.11.2026 9:17:58 PM 10.11.2026 9:17:59 PM 00:00:01:000 · #test-id=9
    StatusTimestampDetails
    Fail 9:17:58 PM checkoutTest FAILED
    Fail 9:17:58 PM Index 2 out of bounds for length 0
  • LoginCSVTest

    9:18:02 PM / 00:00:01:502 Fail

    LoginCSVTest
    10.11.2026 9:18:02 PM 10.11.2026 9:18:03 PM 00:00:01:502 · #test-id=10
    StatusTimestampDetails
    Fail 9:18:03 PM LoginCSVTest FAILED
    Fail 9:18:03 PM no such element: Unable to locate element: {"method":"xpath","selector":"//a[@title="View my customer account"]//span"} (Session info: chrome=154.0.8037.97) For documentation on this error, please visit: https://www.selenium.dev/documentation/webdriver/troubleshooting/errors#nosuchelementexception Build info: version: '4.48.0', revision: '27f5213 27f5213055e28398a5105b7892b7a3bb2012a6ef' System info: os.name: 'Linux', os.arch: 'amd64', os.version: '6.17.0-1022-azure', java.version: '11.0.32.1' Driver info: org.openqa.selenium.chrome.ChromeDriver Command: [157790479fe3d148577dcc0ba6401b73, findElement {using=xpath, value=//a[@title="View my customer account"]//span}] Capabilities {acceptInsecureCerts: false, browserName: chrome, browserVersion: 154.0.8037.97, chrome: {chromedriverVersion: 154.0.8037.92 (334b65d254cc..., userDataDir: /tmp/org.chromium.Chromium....}, fedcm:accounts: true, goog:chromeOptions: {debuggerAddress: localhost:38763}, goog:processID: 3858, networkConnectionEnabled: false, pageLoadStrategy: normal, platformName: linux, proxy: Proxy(), se:cdp: ws://localhost:38763/devtoo..., se:cdpVersion: 154.0.8037.97, setWindowRect: true, strictFileInteractability: false, timeouts: {implicit: 0, pageLoad: 300000, script: 30000}, unhandledPromptBehavior: dismiss and notify, webauthn:extension:cmtgKey: true, webauthn:extension:credBlob: true, webauthn:extension:largeBlob: true, webauthn:extension:minPinLength: true, webauthn:extension:prf: true, webauthn:virtualAuthenticators: true} Session ID: 157790479fe3d148577dcc0ba6401b73
  • LoginExcelTest

    9:18:02 PM / 00:00:01:453 Skip

    LoginExcelTest
    10.11.2026 9:18:02 PM 10.11.2026 9:18:04 PM 00:00:01:453 · #test-id=11
    StatusTimestampDetails
    Skip 9:18:04 PM LoginExcelTest SKIPPED
  • verifyProductSearchTest

    9:18:05 PM / 00:00:02:458 Fail

    verifyProductSearchTest
    10.11.2026 9:18:05 PM 10.11.2026 9:18:07 PM 00:00:02:458 · #test-id=12
    StatusTimestampDetails
    Fail 9:18:07 PM verifyProductSearchTest FAILED
    Fail 9:18:07 PM expected [true] but found [false]
  • LoginExcelTest

    9:18:09 PM / 00:00:01:444 Fail

    LoginExcelTest
    10.11.2026 9:18:09 PM 10.11.2026 9:18:11 PM 00:00:01:444 · #test-id=13
    StatusTimestampDetails
    Fail 9:18:11 PM LoginExcelTest FAILED
    Fail 9:18:11 PM no such element: Unable to locate element: {"method":"xpath","selector":"//a[@title="View my customer account"]//span"} (Session info: chrome=154.0.8037.97) For documentation on this error, please visit: https://www.selenium.dev/documentation/webdriver/troubleshooting/errors#nosuchelementexception Build info: version: '4.48.0', revision: '27f5213 27f5213055e28398a5105b7892b7a3bb2012a6ef' System info: os.name: 'Linux', os.arch: 'amd64', os.version: '6.17.0-1022-azure', java.version: '11.0.32.1' Driver info: org.openqa.selenium.chrome.ChromeDriver Command: [7b17fea3e3da5f4d73d5ad9c5b8aa3dd, findElement {using=xpath, value=//a[@title="View my customer account"]//span}] Capabilities {acceptInsecureCerts: false, browserName: chrome, browserVersion: 154.0.8037.97, chrome: {chromedriverVersion: 154.0.8037.92 (334b65d254cc..., userDataDir: /tmp/org.chromium.Chromium....}, fedcm:accounts: true, goog:chromeOptions: {debuggerAddress: localhost:35667}, goog:processID: 4363, networkConnectionEnabled: false, pageLoadStrategy: normal, platformName: linux, proxy: Proxy(), se:cdp: ws://localhost:35667/devtoo..., se:cdpVersion: 154.0.8037.97, setWindowRect: true, strictFileInteractability: false, timeouts: {implicit: 0, pageLoad: 300000, script: 30000}, unhandledPromptBehavior: dismiss and notify, webauthn:extension:cmtgKey: true, webauthn:extension:credBlob: true, webauthn:extension:largeBlob: true, webauthn:extension:minPinLength: true, webauthn:extension:prf: true, webauthn:virtualAuthenticators: true} Session ID: 7b17fea3e3da5f4d73d5ad9c5b8aa3dd
  • LoginExcelTest

    9:18:16 PM / 00:00:01:976 Pass

    LoginExcelTest
    10.11.2026 9:18:16 PM 10.11.2026 9:18:18 PM 00:00:01:976 · #test-id=14
    StatusTimestampDetails
    Pass 9:18:18 PM LoginExcelTest PASSED

Started

Oct 11, 2026 09:17:35 PM

Ended

Oct 11, 2026 09:18:22 PM

Tests Passed

4

Tests Failed

7

Tests
Log events

Timeline